[an error occurred while processing this directive] [an error occurred while processing this directive][an error occurred while processing this directive] [an error occurred while processing this directive] [an error occurred while processing this directive] [an error occurred while processing this directive] (none) [an error occurred while processing this directive] [an error occurred while processing this directive] [an error occurred while processing this directive] [an error occurred while processing this directive] [an error occurred while processing this directive][an error occurred while processing this directive] [an error occurred while processing this directive][an error occurred while processing this directive] [an error occurred while processing this directive][an error occurred while processing this directive] [an error occurred while processing this directive] [an error occurred while processing this directive] [an error occurred while processing this directive] (none) [an error occurred while processing this directive] [an error occurred while processing this directive] [an error occurred while processing this directive][an error occurred while processing this directive]
 
[an error occurred while processing this directive] [an error occurred while processing this directive]
Skåne Sjælland Linux User Group - http://www.sslug.dk Home   Subscribe   Mail Archive   Forum   Calendar   Search
MhonArc Date: [Date Prev] [Date Index] [Date Next]   Thread: [Date Prev] [Thread Index] [Date Next]   MhonArc
 

Kompilering af arts-1.3.2 fejler



Jeg forsøger at kompilere kde, startende med arts.

Uanset om jeg blot kører en ./configure (uden flag) eller

./configure --disable-debug --disable-warnings --enable-static

så fejler make når den når til
std::_Rb_tree_node_base*

Er der en, der kan pege mig i den rigtige retning?

(QT er kompileret som "-thread -static", det er den eneste måde at få den i hus).

Output fra make:

.libs/dynamicskeleton.o(.gnu.linkonce.t._ZNSt8_Rb_treeISsSt4pairIKSsN4Arts19DynamicSkeletonData13InterfaceTypeEESt10_Select1stIS5_ESt4lessISsESaIS5_EE13insert_uniqueERKS5_+0x11f): In function `std::_Rb_tree<std::basic_string<char, std::char_traits<char>, std::allocator<char> >, std::pair<std::basic_string<char, std::char_traits<char>, std::allocator<char> > const, Arts::DynamicSkeletonData::InterfaceType>, std::_Select1st<std::pair<std::basic_string<char, std::char_traits<char>, std::allocator<char> > const, Arts::DynamicSkeletonData::InterfaceType> >, std::less<std::basic_string<char, std::char_traits<char>, std::allocator<char> > >, std::allocator<std::pair<std::basic_string<char, std::char_traits<char>, std::allocator<char> > const, Arts::DynamicSkeletonData::InterfaceType> > >::insert_unique(std::pair<std::basic_string<char, std::char_traits<char>, std::allocator<char> > const, Arts::DynamicSkeletonData::InterfaceType> const&)':
: undefined reference to `std::_Rb_tree_decrement(std::_Rb_tree_node_base*)'
.libs/dynamicskeleton.o(.gnu.linkonce.t._ZNSt8_Rb_treeISsSt4pairIKSsN4Arts19DynamicSkeletonData13InterfaceTypeEESt10_Select1stIS5_ESt4lessISsESaIS5_EE13insert_uniqueESt17_Rb_tree_iteratorIS5_ERKS5_+0x45): In function `std::_Rb_tree<std::basic_string<char, std::char_traits<char>, std::allocator<char> >, std::pair<std::basic_string<char, std::char_traits<char>, std::allocator<char> > const, Arts::DynamicSkeletonData::InterfaceType>, std::_Select1st<std::pair<std::basic_string<char, std::char_traits<char>, std::allocator<char> > const, Arts::DynamicSkeletonData::InterfaceType> >, std::less<std::basic_string<char, std::char_traits<char>, std::allocator<char> > >, std::allocator<std::pair<std::basic_string<char, std::char_traits<char>, std::allocator<char> > const, Arts::DynamicSkeletonData::InterfaceType> > >::insert_unique(std::_Rb_tree_iterator<std::pair<std::basic_string<char, std::char_traits<char>, std::allocator<char> > const, Arts::DynamicSkeletonData::InterfaceType> >, std::pair<std::basic_string<char, std::char_traits<char>, std::allocator<char> > const, Arts::DynamicSkeletonData::InterfaceType> const&)':
: undefined reference to `std::_Rb_tree_decrement(std::_Rb_tree_node_base*)'
collect2: ld returned 1 exit status
make[2]: *** [libmcop.la] Error 1
make[2]: Leaving directory `/usr/src/kde/arts-1.3.2/mcop'
make[1]: *** [all-recursive] Error 1
make[1]: Leaving directory `/usr/src/kde/arts-1.3.2'
make: *** [all] Error 2


 
Home   Subscribe   Mail Archive   Index   Calendar   Search

 
 
Questions about the web-pages to <www_admin>. Last modified 2005-08-10, 22:44 CEST [an error occurred while processing this directive]
This page is maintained by [an error occurred while processing this directive]MHonArc [an error occurred while processing this directive] # [an error occurred while processing this directive] *