[an error occurred while processing this directive] [an error occurred while processing this directive][an error occurred while processing this directive] [an error occurred while processing this directive] [an error occurred while processing this directive] [an error occurred while processing this directive] (none) [an error occurred while processing this directive] [an error occurred while processing this directive] [an error occurred while processing this directive] [an error occurred while processing this directive] [an error occurred while processing this directive][an error occurred while processing this directive] [an error occurred while processing this directive][an error occurred while processing this directive] [an error occurred while processing this directive][an error occurred while processing this directive] [an error occurred while processing this directive] [an error occurred while processing this directive] [an error occurred while processing this directive] (none) [an error occurred while processing this directive] [an error occurred while processing this directive] [an error occurred while processing this directive][an error occurred while processing this directive]
 
[an error occurred while processing this directive] [an error occurred while processing this directive]
Skåne Sjælland Linux User Group - http://www.sslug.dk Home   Subscribe   Mail Archive   Forum   Calendar   Search
MhonArc Date: [Date Prev] [Date Index] [Date Next]   Thread: [Date Prev] [Thread Index] [Date Next]   MhonArc
 

Re: fejl ved installering af zoran driver



Jean Christophe a écrit :

Foerst og fremst, tak til Martin Berg svar angaaende spoergsmaal om en tv kort.
Jeg har nu debugget min kerne (2.6.3), jeg har krydstet v4l og M ved ic2.
Jeg har downloadet zorandriver 0.9.4 i /temp
Jeg pakker den ud og lave en "make",
Herned foelger output:


sslug@sslug driver-zoran-0.9.4]# make
Making Unified Zoran (zr360x7) driver for 2.6.3-1-vfl kernel...
make[1]: Entering directory `/usr/src/linux-2.6.3'
*** Warning: Overriding SUBDIRS on the command line can cause
*** inconsistencies
make[2]: `arch/i386/kernel/asm-offsets.s' is up to date.
CC [M] /tmp/driver-zoran-0.9.4/zoran_driver.o
/tmp/driver-zoran-0.9.4/zoran_driver.c:54:27: linux/wrapper.h: No such file or directory
/tmp/driver-zoran-0.9.4/zoran_driver.c: In function `v4l_fbuffer_alloc':
/tmp/driver-zoran-0.9.4/zoran_driver.c:360: warning: implicit declaration of function `mem_map_reserve'
/tmp/driver-zoran-0.9.4/zoran_driver.c: In function `v4l_fbuffer_free':
/tmp/driver-zoran-0.9.4/zoran_driver.c:480: warning: implicit declaration of function `mem_map_unreserve'
/tmp/driver-zoran-0.9.4/zoran_driver.c: In function `zoran_open':
/tmp/driver-zoran-0.9.4/zoran_driver.c:1265: error: called object is not a function
make[2]: *** [/tmp/driver-zoran-0.9.4/zoran_driver.o] Error 1
make[1]: *** [/tmp/driver-zoran-0.9.4] Error 2
make[1]: Leaving directory `/usr/src/linux-2.6.3'
make: *** [here] Error 2


Jeg kan godt bruge nogen input, for jeg har ingen anelse om hvad der foregaar.
Tak
Med venlig hilsen
Jean Christophe


Jeg har fundet nogen patch paa : http://bytesex.org/patches/
Skulle jeg saa have en kernel 2.6.5 i stedet ? og patche den med ...?
Der er 14 forskellige, og jeg toer ikke betragte dem som en lotteri !
Fortsaet god week end
Jean Christophe


 
Home   Subscribe   Mail Archive   Index   Calendar   Search

 
 
Questions about the web-pages to <www_admin>. Last modified 2005-08-10, 20:51 CEST [an error occurred while processing this directive]
This page is maintained by [an error occurred while processing this directive]MHonArc [an error occurred while processing this directive] # [an error occurred while processing this directive] *